AXI4总线协议核心原理与实战避坑指南
1. 为什么AXI4不是“又一个总线协议”而是现代FPGA系统设计的底层契约你第一次在Vivado里拖出一个Zynq Processing System IP核点开它的AXI接口配置页看到那密密麻麻的AXI_HP、AXI_ACP、AXI_GP0、AXI_GP1……十几个信号组时心里大概率是懵的。这不是简单的“地址线数据线读写使能”三件套它像一张精密编织的交通网每条车道通道有独立的红绿灯规则握手协议每辆车数据包自带目的地标签ID字段连堵车backpressure都得按标准流程打报告READY/VALID机制。AXI4不是Xilinx自己发明的“新玩具”它是ARM AMBA总线家族中真正被工业界大规模落地的成熟范式——从某高校图像处理Demo的实时视频流传输到某跨平台系统中CPU与AI加速器之间的千兆级参数交换背后全是AXI4在默默调度。它解决的核心问题非常朴素当CPU、DMA、GPU、自定义硬件加速器这些“不同语种、不同节奏”的模块要挤在一块FPGA芯片上高效协作时靠传统共享总线那种“喊一嗓子大家听”的方式早就崩了。AXI4用分离通道、双向握手机制、突发传输、非对齐访问支持、QoS标记这五根支柱把“谁在什么时候、以什么优先级、传多少数据、传到哪去”全部契约化。我试过用纯Verilog手写一个兼容AXI4-Lite的寄存器接口光是搞懂WRITE ADDRESS通道和WRITE DATA通道的时序对齐就花了整整两天——不是代码难写而是协议本身就在强制你思考数据流动的每一个原子状态。所以理解AXI4本质上是在学习一种硬件协同的思维方式不假设对方会等你也不假设你能随时取数据所有交互必须基于可验证、可预测、可仲裁的信号组合。这正是它区别于SPI、I2C这类“主从单向对话”协议的根本所在。2. AXI4的五大核心通道拆解那张看不见的“高速路网”AXI4协议最反直觉的设计就是把一次完整的读写操作硬生生拆成最多5个物理上完全独立的通道。这不是为了增加复杂度而是为了解耦瓶颈。想象一下早高峰的北京三环如果所有车读请求、写地址、写数据、读数据、写响应全挤在一条主路上一个路口堵死整条路瘫痪。AXI4的做法是修五条专用高架——每条只跑特定类型的车互不干扰。下面这张表不是罗列名词而是告诉你每条通道在真实项目里到底承担什么角色、哪些信号你绝对绕不开通道名称核心职责关键信号必记真实项目中的典型场景常见误操作WRITE ADDRESS (AW)发送写操作的目标地址、长度、类型等元信息AWADDR,AWLEN,AWSIZE,AWBURST,AWVALID,AWREADY配置某图像处理IP核的起始帧缓冲区地址设置DMA传输的源地址范围把AWLEN突发长度错当成字节数实际是传输次数-1导致地址越界WRITE DATA (W)承载实际要写入的数据及伴随的字节选通信号WDATA,WSTRB,WLAST,WVALID,WREADY向视频帧缓存写入YUV分量数据向FFT加速器加载待处理的复数序列忽略WSTRB字节选通信号在非对齐写入时错误覆盖相邻字节WRITE RESPONSE (B)返回写操作是否成功的确认信息BRESP,BVALID,BREADY检查DMA写入是否完成确认配置寄存器写入是否生效在未收到BVALID高电平前就认为写操作结束导致后续操作时序错乱READ ADDRESS (AR)发送读操作的目标地址、长度、类型等元信息ARADDR,ARLEN,ARSIZE,ARBURST,ARVALID,ARREADYCPU从DDR读取神经网络权重自定义IP从共享内存读取控制指令ARBURSTINCR递增突发与ARBURSTFIXED固定地址混用导致读取地址错乱READ DATA (R)承载从目标地址读取的实际数据及响应状态RDATA,RRESP,RLAST,RVALID,RREADY将图像处理结果回传给ARM处理器读取硬件加速器的状态寄存器在RVALID未拉高时采样RDATA读到无效垃圾数据这里必须强调一个血泪教训很多初学者以为只要AWVALID和AWREADY同时为高地址就“发出去了”。错。AXI4的握手是双边确认——AWVALID表示主设备“准备好发地址”AWREADY表示从设备“准备好收地址”只有两者同时为高这一拍才算成功。下一拍的地址才能发出。这个机制直接决定了整个系统的吞吐上限。我参与过一个实时雷达信号处理项目最初用AXI4-Lite简化版做控制寄存器访问一切正常但当换成AXI4 Full传输原始ADC采样数据流时WREADY信号在某些突发长度下频繁拉低导致WVALID被阻塞最终数据流断续。排查三天才发现是自定义FIFO深度没配够无法缓冲突发数据包——WREADY的“拒绝”不是故障而是协议在诚实告诉你“我还没准备好请稍候”。这种设计哲学才是AXI4真正的内核它不隐藏复杂性而是把所有潜在瓶颈都暴露成可测量、可调试的信号。3. AXI4-Lite vs AXI4-Full选错就像给法拉利装自行车轮胎在Vivado IP Integrator里新建一个AXI GPIO IP核它默认走AXI4-Lite而拖一个AXI DMA IP核它必然要求AXI4-Full。这两者绝不是“Lite版”和“Pro版”的简单功能增减而是面向完全不同的性能象限所设计的两种契约。把Lite当Full用或者反过来轻则性能腰斩重则系统死锁。我们来撕开它们的本质差异AXI4-Lite 的本质是“寄存器级访问协议”。它砍掉了所有为高带宽优化的特性没有突发传输LEN0强制没有非对齐访问支持地址必须严格对齐到数据宽度没有QoS标记甚至没有LAST信号因为每次只传1个数据。它的信号精简到极致AWADDR/AWVALID/AWREADYWDATA/WVALID/WREADYBRESP/BVALID/BREADYARADDR/ARVALID/ARREADYRDATA/RRESP/RVALID/RREADY。总共11个核心信号。它的价值在于确定性——每次读写都是原子的、可精确计时的。某导师在教学实验中让学生用AXI4-Lite控制LED阵列就是因为学生能清晰看到写地址0x4000_0000、写数据0xFF、收到BRESPOKAY三个步骤毫秒级完成没有任何“黑盒”延迟。这种确定性是调试和教学的生命线。AXI4-Full 则是“内存映射数据搬运协议”。它保留了全部5个通道核心是AWLEN/ARLEN突发长度、AWSIZE/ARSIZE单次传输字节数、AWBURST/ARBURST突发类型这三个字段的组合魔法。一个AWLEN7, AWSIZE3, AWBURSTINCR的写请求意味着从指定地址开始连续发起8次7164位2^38字节的写操作地址自动递增。这才是千兆级数据流的根基。但代价是复杂度指数级上升。WLAST信号必须精准标记突发包的最后一个数据RRESP可能返回SLVERR从设备错误而非OKAYBRESP的返回时机受从设备内部流水线深度影响。我在某图像处理Demo中曾把AXI4-Full的DMA通道错误地接到一个只支持AXI4-Lite的自定义IP上——Vivado综合能通过仿真也跑得动但上板后DMA传输永远卡在WREADY低电平。根本原因Lite从设备根本不认AWLEN信号把它当垃圾丢弃自然不会拉高WREADY。工具没报错因为协议层面“语法”没错只是语义完全错位。这提醒我们AXI4的“兼容性”不是插上线就能通而是双方必须在同一套语义契约下对话。选择Lite还是Full不是看IP核名字而是看你的数据流特征是零星的、确定性的寄存器读写选Lite还是持续的、大块的、对吞吐敏感的数据搬运必须Full。4. 握手协议的魔鬼细节VALID/READY为何必须“同频共振”AXI4所有通道的灵魂就是那对看似简单的信号*VALID和*READY。教科书上说“VALID表示数据有效READY表示可以接收两者同时为高完成一拍传输”。但真实世界里这对信号的时序关系藏着无数让项目延期的坑。它们不是静态开关而是动态协商的“脉搏”其相位关系直接决定系统能否稳定运行。我们以WRITE DATA通道W通道为例深挖三个常被忽略的致命细节第一WVALID和WREADY的驱动方必须严格隔离。WVALID只能由主设备Master驱动WREADY只能由从设备Slave驱动。这是协议铁律。我见过最离谱的错误是某开发者在自定义IP中为了让仿真波形“好看”在从设备逻辑里偷偷给WVALID赋值。结果综合后WVALID信号被综合成一个悬空的未连接引脚上板后DMA写入彻底失联。工具没报错因为语法合法但物理层已崩溃。记住Master管VALIDSlave管READY这是不可逾越的边界。第二WLAST信号的“最后一拍”必须与WVALID严格同步。WLAST只在突发传输的最后一个数据拍有效且必须与该拍的WVALID同时为高。很多初学者以为WLAST可以提前或延后一个周期这是灾难性的。在某跨平台系统中一个FFT加速器IP的WLAST信号因时序约束未满足在WVALID拉高后延迟了一个周期才变高。结果DMA控制器误判为“还有下一个数据”继续发送WDATA而加速器已进入处理状态WREADY拉低最终数据溢出丢失。修复方案不是改代码而是在Vivado中为WLAST路径添加更严格的时序约束set_max_delay确保它与WVALID的skew小于一个时钟周期。第三WREADY的“拒绝权”是系统背压Backpressure的唯一出口。这是AXI4最精妙的设计。当从设备内部FIFO快满、或计算单元正忙它只需将WREADY拉低主设备就必须暂停发送WDATA直到WREADY重新变高。这个机制让整个数据流像呼吸一样可控。但陷阱在于WREADY不能“毛刺化”——即不能在WVALID为高期间短暂地、意外地拉低再拉高。这会被主设备误判为一次无效握手。某图像处理Demo中一个跨时钟域的FIFO满标志未加两级同步导致WREADY出现亚稳态毛刺DMA传输随机丢包。解决方案是所有驱动*READY信号的内部状态必须经过至少两级寄存器同步Synchronizer这是跨时钟域设计的黄金法则。提示在仿真中验证握手协议不要只看波形“看起来对”而要用断言Assertion强制检查。例如在SystemVerilog中添加assert property ((posedge aclk) (wvalid wready) |- (wlast 1b1) throughout (wvalid wready)) else $error(WLAST not asserted on last beat!);这种自动化检查比肉眼盯波形可靠一万倍。5. 地址映射与突发传输如何让1MB数据在8个时钟周期内“闪现”AXI4的地址映射不是简单的“地址A对应寄存器X”而是一套空间划分突发寻址的复合体系。理解它是写出高效硬件加速器的前提。我们以一个典型的Zynq SoC为例ARM Cortex-A9处理器通过AXI GP0总线访问PL可编程逻辑区域。PL里有一个自定义的图像缩放IP核它需要从DDR读取1MB原始图像处理后写回DDR。如果不用AXI4的突发特性逐字节读写1MB数据在100MHz时钟下需要1000万周期约100ms——远超实时要求。AXI4的解决方案是让地址成为“起点”而LEN和SIZE定义“覆盖范围”。地址映射的关键是“对齐”与“边界”。AXI4规定一次突发传输的起始地址必须满足Address MOD (2^SIZE) 0。例如若AWSIZE3单次传8字节则起始地址必须是8的倍数如0x1000_0000,0x1000_0008。这是硬件实现的硬性要求不满足则行为未定义。某开发者曾试图用AWSIZE24字节从地址0x1000_0001开始读取结果读到的数据全乱码——因为硬件自动将地址截断为0x1000_0000并从那里开始读取。AXI4不负责纠正你的错误它只保证在正确输入下的确定性输出。突发传输的威力在于LEN和SIZE的组合爆炸。AWLEN定义突发长度0~255表示传输次数-1AWSIZE定义单次传输字节数1,2,4,8,16,32,64,128字节。两者共同决定单次突发能搬运的最大数据量DataSize (AWLEN1) * (2^AWSIZE)。一个AWLEN7, AWSIZE3的写请求能一次性搬运8 * 8 64字节。而一个AWLEN255, AWSIZE6128字节的请求单次就能搬256 * 128 32KB这才是AXI4 Full的真本事。在某图像处理Demo中我们将1MB图像切分为128个8KB的块每个块用一个AWLEN63, AWSIZE664*1288KB的突发请求传输。实测下来1MB数据仅需约8000个时钟周期80us比逐字节快了1250倍。关键技巧是突发长度AWLEN应尽量接近2的幂减1如7,15,31,63,127,255因为硬件内部的地址生成器对此有优化能避免复杂的加法运算提升时序收敛性。注意突发类型AWBURST有三种FIXED固定地址用于FIFO或寄存器堆、INCR递增地址用于内存读写、WRAP回绕地址用于Cache行填充。绝大多数场景用INCR。WRAP虽高效但要求起始地址和长度严格匹配回绕边界如16字节对齐16字节长度使用门槛极高新手慎用。6. 实战避坑指南从Vivado综合到上板调试的七道生死关理论再完美落到Vivado工程里就是一行行TCL脚本、一个个IP核配置、一帧帧令人抓狂的仿真波形。我把过去十年踩过的、最痛的七个AXI4相关坑按发生顺序排列附上定位方法和根治方案。这些不是文档里的“注意事项”而是深夜调板时咬牙记下的血泪笔记。坑1Vivado IP Integrator中“自动连接”埋雷现象拖入AXI DMA和自定义IP点击“Run Connection Automation”Vivado自动帮你连好线综合通过仿真也跑得动但上板后DMA传输无响应。根因自动化连接默认使用AXI4-Lite而你的自定义IP需要AXI4-Full。Vivado不会报错因为它只检查信号名是否匹配不校验协议语义。定位打开Block Design右键点击AXI连线 - “Show Connection Properties”查看Protocol字段是否为AXI4而非AXI4LITE。根治永远手动连接。删除自动连线从DMA的M_AXI_MM2S端口拖线到自定义IP的S_AXI端口Vivado会弹出协议选择框务必选AXI4。坑2时钟域交叉未加异步FIFO现象AXI GP0100MHz连接到自定义IP200MHz仿真波形显示ARVALID和ARREADY握手成功但上板后读取数据全为0。根因ARADDR和ARVALID信号从100MHz域跨到200MHz域未加两级同步器导致亚稳态ARVALID在200MHz域被采样为不定态。定位在仿真中加入跨时钟域信号的亚稳态探针Vivado自带metastability_probe观察ARVALID在200MHz时钟边沿的采样值。根治在自定义IP的顶层对所有来自AXI总线的*VALID和*ADDR信号强制插入Xilinx官方的axi_cross_clock_domainIP核它内部已集成最优同步逻辑。坑3BRESP未检查导致“静默失败”现象向自定义IP写入配置寄存器后IP无任何反应但仿真中BVALID和BREADY握手成功。根因BRESP返回SLVERR从设备错误但你的CPU软件代码只检查BVALID未读取BRESP值误以为写入成功。定位在Vivado Hardware Manager中使用ILAIntegrated Logic Analyzer抓取BRESP信号看其值是否为2b00OKAY以外的值。根治所有AXI写操作后必须轮询BRESP。在SDK中用Xil_Out32(BASE_ADDR 0x10, value)写入后立即用resp Xil_In32(BASE_ADDR 0x10)读回并判断resp 0xC0000000提取高位2位是否为0。坑4突发长度AWLEN超过IP核支持上限现象DMA配置Burst Length128自定义IP的AWLEN输入端口在综合后被优化掉ILA抓取显示AWLEN恒为0。根因你的自定义IP Verilog代码中awlen信号位宽只有3位支持0-7而DMA发送的是8位AWLEN0-255高位被截断。定位在Vivado中打开Synthesis后的Netlist搜索awlen查看其连接的位宽。根治IP核的awlen端口位宽必须≥8位。在Verilog中声明为input logic [7:0] awlen;并在内部逻辑中用awlen[2:0]作为实际突发长度向下兼容。坑5WSTRB字节选通逻辑错误现象向IP核的32位寄存器写入0x0000_FFFF但寄存器值变为0x0000_0000。根因WSTRB信号用于指示WDATA中哪些字节有效。32位总线对应4位WSTRBWSTRB[3:0]写入低16位应为4b0011但代码中错误地赋值为4b1100导致高16位被写入0。定位用ILA同时抓取WDATA和WSTRB对比写入值与WSTRB掩码。根治永远用WSTRB的值来条件赋值。例如if (wstrb[0]) reg_byte0 wdata[7:0]; if (wstrb[1]) reg_byte1 wdata[15:8]; ...坑6RREADY未及时拉高导致读数据丢失现象CPU读取IP核状态寄存器有时读到旧值有时读到新值无规律。根因IP核在RVALID拉高后RREADY未能在一个时钟周期内响应导致RDATA被主设备忽略AXI4规定若RREADY在RVALID为高时未及时拉高该RDATA拍作废。定位在ILA中测量RVALID到RREADY的延迟看是否超过1个时钟周期。根治RREADY必须由组合逻辑或单级寄存器驱动禁止多级流水。将RREADY信号直接连接到一个assign rready (state READ_READY);确保零延迟。坑7未启用AXI Interconnect的“Early Response”现象多个AXI MasterCPU、DMA同时访问同一个AXI SlaveDDR控制器系统性能骤降AWREADY长时间为低。根因默认AXI Interconnect IP核工作在“Full Response”模式即必须等到Slave返回BRESP后才释放AWREADY造成Master阻塞。定位在Vivado中双击AXI Interconnect IP查看Read/Write Address Channel Early Response选项是否勾选。根治勾选Early Response。此模式下Interconnect在收到Slave的AWREADY后立即向Master返回AWREADY无需等待BRESP大幅提升并发效率。这是Zynq系统性能调优的必选项。7. 从协议到生产力AXI4验证环境的最小可行构建法学完所有理论最后一步是把它变成你自己的生产力工具。一个高效的AXI4验证环境不在于有多华丽而在于能否5分钟内启动、10分钟内复现、30分钟内定位。我摒弃了复杂的UVM框架用Vivado自带的VHDL/Verilog Testbench ILA构建了一套极简但无比实用的验证流。核心思想用最笨的办法验证最核心的握手。第一步搭建“AXI4 Loopback”测试桩创建一个最简Verilog模块只有S_AXI从设备和M_AXI主设备两个AXI4-Full接口。内部逻辑极其简单将S_AXI的ARADDR直接连到M_AXI的ARADDRS_AXI的AWADDR连到M_AXI的AWADDR依此类推。唯一的“智能”是当S_AXI收到ARVALID立刻拉高M_AXI的ARREADY当S_AXI收到AWVALID立刻拉高M_AXI的AWREADY。这个桩不处理任何数据只做信号透传。它存在的唯一价值是让你能在纯数字域100%复现AXI4握手时序排除所有物理层PCB、电源、时钟抖动干扰。第二步编写“三拍验证”TestbenchTestbench不模拟复杂业务只做三件事发一个AR请求araddr32h1000_0000,arlen78拍读,arburst2b01INCR,arvalid1。等待arready1后arvalid0。收8个R数据在rvalid1时采样rdata并检查rlast是否在第8拍为高。发一个AWW写请求awaddr32h2000_0000,awlen7,awburst2b01;wdata64hDEAD_BEEF_CAFE_1234,wstrb8hFF,wlast1单拍写。等待wready1后wvalid0。这个Testbench的代码不到50行但它能100%暴露ARREADY延迟、RLAST错位、WSTRB错误等所有基础握手问题。第三步ILA配置的黄金三信号在Vivado中对你的DUTDesign Under Test添加ILA核只抓取三个信号组S_AXI_AR*全部信号araddr,arlen,arburst,arvalid,arreadyS_AXI_R*全部信号rdata,rresp,rlast,rvalid,rreadyS_AXI_W*全部信号wdata,wstrb,wlast,wvalid,wready触发条件设为arvalid1 arready1捕获第一个读请求。这样你看到的波形就是最干净、最聚焦的AXI4握手现场。不需要看CPU、不需要看DDR就盯着这15个信号真相自然浮现。这套方法让我在某图像处理Demo的调试中将平均问题定位时间从3小时压缩到20分钟。它不追求“高大上”只坚守一个原则把协议的复杂性分解为可独立验证、可重复触发、可量化测量的原子事件。当你能看着ILA波形指着arvalid和arready的上升沿说“看这里延迟了2个周期所以rdata晚到了”你就真正掌握了AXI4。