AXI3协议实战精解:从VALID/READY时序契约到WSTRB字节映射
简介本资源是一份面向数字电路设计工程师、SoC验证工程师及高校微电子/集成电路专业学习者的AMBA AXI3协议深度解析资料聚焦高性能片上互连总线的核心机制与工程落地要点。内容系统覆盖AXI3协议架构、五大独立通道读/写地址、读/写数据、写响应的信号定义与VALID/READY握手机制、分离式读写通路、outstanding与乱序传输原理、字节选通非对齐访问、突发传输模式等关键特性并结合典型系统互联拓扑与时序收敛实践展开说明。资源为1个1.5MB的PDF文档结构完整含图示通道模型如图1-1读通道、图1-2写通道、协议规范原文节选及中文技术注解便于对照标准快速理解实现细节。目前已有530人学习下载适合需深入掌握AXI总线协议以开展IP集成、FPGA验证或SoC架构设计的中高级硬件开发人员。1. AMBA AXI3中文协议详解不是“看懂就行”的文档而是你写AXI Slave前必须亲手拆解的黑匣子你手头正卡在一个 AXI Slave 的 RTL 实现上地址通道能握手但一发 4-beat INCR 写就丢数据或者读响应总卡在 BVALID 拉不起来又或者仿真里 RLAST 总比预期晚一个周期——这时候翻英文 Spec 看到 “AWADDR must be aligned to AWSIZE” 这句话你心里清楚问题不在语法而在你根本没把 AXI3 的地址生成逻辑、字节选通映射、ID 依赖链这三根骨头从协议里完整剔出来。这份《AMBA AXI3中文协议详解》不是翻译腔说明书它是某高校数字电路实验室用三年时间把 ARM 官方 V1.0 规范逐页反编译、用 ModelSim 跑出 27 个边界 case、最终沉淀下来的实战笔记。它专治三类人刚写完第一个 AXI Master 模块却不敢碰 Slave 的 FPGA 新手被 SoC 集成方反复退回“outstanding 行为不符合 ID ordering”的验证工程师还有那些在 UVM testbench 里硬塞repeat(100) (posedge clk)却始终复现不了乱序死锁的验证老手。它不讲“AXI 是什么”只告诉你“当 AWLEN4、AWSIZE2、AWBURST1 时第 3 个 beat 的 WSTRB[3:0] 必须是 4’b0011否则从机 FIFO 会漏采第 5 字节”——这种颗粒度才是你真正需要的落地依据。2. AXI3 协议核心机制拆解从握手本质到 ID 语义为什么 VALID/READY 不是“握手礼节”而是时序契约AXI3 的五通道AW/AR/W/R/B表面看是并行总线实则是五条独立流控管道。每条管道的 VALID/READY 握手不是礼貌性确认而是硬性时序契约只有 VALID 和 READY 同时为高该拍的数据/地址/响应才被采样且采样沿严格限定在 ACLK 上升沿。这个看似简单的规则直接决定了你 RTL 中寄存器插入位置、跨时钟域处理方式、甚至综合后能否收敛。下面从三个不可绕过的底层机制展开。2.1 VALID/READY 的默认电平与死锁红线为什么 AWREADY 默认高是“双刃剑”协议明确指出AWREADY默认值可为高或低但强烈推荐默认高。这不是风格偏好而是时序安全边界。我们用一段可综合的 Verilog 代码说明其物理含义// 推荐写法AWREADY 默认高从机随时可收地址 always (posedge ACLK or negedge ARESETn) begin if (!ARESETn) begin awready 1b1; // 关键默认高 end else begin // 仅当内部地址解码器忙时拉低 if (addr_decoder_busy) begin awready 1b0; end else begin awready 1b1; end end end逻辑说明当awready默认为高时主机只要拉高awvalid地址就在下一个时钟沿被采样。这极大简化了主机侧逻辑也避免了“主机等awready、从机等awvalid”的双向等待死锁。但代价是从机必须保证在awready为高期间任何时刻收到的awaddr都能被立即解码。若你的地址解码器有 2 级组合逻辑而时钟频率达 300MHz就必须在awready前插入一级寄存器此时awready默认值必须改为低并显式控制其拉高时机。2.2 ID 字段的双重语义排序锚点 虚拟主机标识不是“随便配个数”AWID/ARID/WID/RID/BID这五个 ID 信号常被新手当作“事务编号”简单处理。但协议 1.3.4 节明确指出ID 是乱序执行的唯一仲裁依据且多主机系统中需由互连Interconnect扩展为全局唯一。这意味着同一主机发出的两个写事务若AWID相同则BRESP必须按发送顺序返回In-order completion若AWID不同则BRESP可乱序返回Out-of-order completion但每个BID对应的响应必须严格匹配原AWID在双核 SoC 中Core0 发送AWID2b00Core1 也发送AWID2b00互连必须将它们重映射为BID3b000和BID3b100否则从机无法区分来源。实际 RTL 中ID 字段常与地址通道绑定传输但绝不能在从机侧丢弃或重映射。以下代码展示正确处理方式// 从机侧ID 必须透传至响应通道且与地址解码结果无关 always (posedge ACLK or negedge ARESETn) begin if (!ARESETn) begin bid_reg 4b0000; bresp_reg 2b00; end else if (bvalid bready) begin // BID 必须等于原始 AWID不可修改 bid_reg awid_reg; // bresp 由地址解码结果决定但 ID 不参与决策 if (addr_in_valid_range) begin bresp_reg 2b00; // OKAY end else begin bresp_reg 2b11; // DECERR end end end2.3 通道间弱耦合与强约束为什么写数据能早于写地址但读数据不能早于读地址AXI3 架构允许五通道异步推进这是实现 high outstanding 的基础。但协议 3.2 节划出两条铁律弱耦合示例允许WVALID可在AWVALID之前拉高。典型场景是主机侧有深度 FIFO 缓存写数据而地址通道路径更长。此时互连必须暂存WDATA待AWADDR到达后再将数据路由至对应从机。强约束示例禁止RVALID绝对不可在ARVALID之前拉高。因为读数据内容完全由ARADDR决定从机无权“预测”主机要读哪里。这一差异直接反映在 RTL 设计哲学上写通道需设计“数据暂存地址匹配”模块例如用AWID作为 key将WDATA存入 RAM待AWADDR解码完成后再取出读通道则必须是“地址驱动型”ARADDR一有效立即启动存储器读取RDATA在RVALID拉高前必须已准备好。参数说明AWID宽度由系统需求决定常见为 4-bit支持 16 个并发事务。若设计目标为 32 个 outstandingAWID至少需 5-bit。宽度不足会导致 ID 重复引发乱序响应错配——这是验证阶段最隐蔽的崩溃点之一。3. 地址与突发计算从公式到 RTL 实现为什么“4KB 边界检查”不是可选项而是必杀技AXI3 的突发Burst机制是性能核心但也是新手翻车重灾区。协议 4.1 节强调“突发不能跨越 4KB 边界”这不是建议而是硬件强制要求。原因在于SoC 中不同从机如 DDR 控制器、UART、GPIO通常挂载在 4KB 对齐的地址空间内若一个 16-beat、每 beat 8 字节的 WRAP 突发起始地址为0x0FFF8则最后一个 beat 地址为0x10078必然跨过0x10000边界导致部分数据被错误路由至相邻从机。下面用真实计算和 RTL 代码揭示其落地细节。3.1 突发地址生成公式的物理映射从纸面公式到可综合逻辑协议 4.5 节给出的地址计算公式必须转化为 RTL 才有意义。以增量突发INCR为例关键变量如下符号含义典型值RTL 实现要点Start_Address主机发送的AWADDR32h0000_1000直接取自awaddr信号Number_Bytes每 beat 字节数 2^AWSIZEAWSIZE3→8assign num_bytes 1 awsizes;Burst_Length突发 beat 数 AWLEN 1AWLEN3→4assign burst_len awlen 1;Aligned_Address对齐起始地址 (Start_Address / Number_Bytes) * Number_Bytes0x0000_1000必须用整除assign aligned_addr {awaddr[31:log2(num_bytes)], {log2(num_bytes){1b0}}};重点来了Aligned_Address的计算绝不能用/运算符综合工具会将其映射为复杂除法器破坏时序。正确做法是利用地址低位全零的特性直接屏蔽低 log2(num_bytes) 位。例如num_bytes83 位则aligned_addr {awaddr[31:3], 3b000}。3.2 回环突发WRAP的双重校验起始地址对齐 突发长度合规WRAP 突发用于 Cache Line 填充其地址卷绕逻辑极易出错。协议 4.4.3 明确两条限制Start_Address必须对齐到Number_Bytes即awaddr[log2(num_bytes)-1:0] 0Burst_Length必须为 2/4/8/16即awlen必须为1/3/7/15。违反任一条件从机行为未定义。RTL 中必须做硬性检查localparam AWLEN_2BEAT 4d1; localparam AWLEN_4BEAT 4d3; localparam AWLEN_8BEAT 4d7; localparam AWLEN_16BEAT 4d15; // 检查起始地址是否对齐 wire addr_aligned (awaddr[log2_num_bytes-1:0] 0); // 检查突发长度是否合法 wire len_valid (awlen AWLEN_2BEAT) || (awlen AWLEN_4BEAT) || (awlen AWLEN_8BEAT) || (awlen AWLEN_16BEAT); // 任意一项失败立即报错可接 assertion 或 error flag assign wrap_error (awburst 2b10) !(addr_aligned len_valid);血泪经验某次 tape-out 前仿真通过但硅片测试发现 Cache Line 填充偶尔失败。最终定位到awsizes信号在awvalid拉高前一个周期才稳定导致addr_aligned判断错误。解决方案所有地址校验逻辑必须与awvalid同步采样即always (posedge ACLK) if (awvalid) begin ... end。3.3 字节选通WSTRB与数据总线的精确映射为什么WSTRB[3:0]不是“掩码”而是“字节坐标”WSTRB信号常被误解为“写使能掩码”实则是每个字节通道的独立使能。协议 2.3 节明确定义WSTRB[n]对应WDATA[(8*n)7 : 8*n]。这意味着当AWSIZE24 字节/beatWSTRB为 4-bitWDATA为 32-bit若awaddr0x10004 字节对齐WSTRB4b1111则WDATA[31:0]全部写入0x1000~0x1003若awaddr0x1001非对齐WSTRB4b0111则WDATA[23:0]写入0x1001~0x1003WDATA[31:24]写入0x1000因地址对齐到字节。RTL 中必须实现动态字节偏移逻辑// 计算字节偏移量基于 awaddr 低 log2(num_bytes) 位 wire [2:0] byte_offset awaddr[2:0]; // 假设 num_bytes8, log23 // 生成 8-bit WSTRB适配 64-bit 数据总线 wire [7:0] wstrb_8bit; assign wstrb_8bit {8{1b0}} | ({8{WSTRB[0]}} byte_offset) | ({8{WSTRB[1]}} (byte_offset1)) | ({8{WSTRB[2]}} (byte_offset2)) | ({8{WSTRB[3]}} (byte_offset3));避坑 / 常见问题 / 排查现象 1非对齐写操作后相邻地址数据被意外覆盖。原因WSTRB未根据awaddr低位动态偏移始终按awaddr[1:0]计算导致字节通道错位。解决严格按awaddr[log2(num_bytes)-1:0]计算偏移且WSTRB宽度必须 ≥num_bytes/8。现象 24-beat INCR 写中第 2 个 beat 的WSTRB全为 0但WVALID仍为高。原因主机侧逻辑错误地认为“地址递增后无需写数据”但协议要求即使WSTRB0WVALID也必须拉高以维持突发完整性。解决主机在WLAST之前WVALID必须全程为高WSTRB全 0 是合法状态表示该 beat 不更新任何字节。现象 3AWBURST2b10WRAP时地址卷绕点计算错误数据写入错误地址。原因Wrap_Boundary公式中Number_Bytes x Burst_Length未做位宽扩展导致乘法溢出。例如num_bytes8,burst_len16结果应为 128但若用 4-bit 信号计算得0。解决所有中间计算使用足够宽的 wire如wire [15:0] wrap_boundary_calc num_bytes * burst_len;。4. 读写响应与错误处理从 OKAY/EXOKAY 到 DECERR为什么响应信号是系统健壮性的最后防线AXI3 的响应信号RRESP/BRESP远不止“成功/失败”两级分类。协议 2.4 和 2.6 节定义的四种编码2b00OKAY,2b01EXOKAY,2b10SLVERR,2b11DECERR构成了一套精密的错误隔离与调试体系。忽略其语义差异轻则导致 DMA 传输卡死重则引发整个 SoC 异常复位。本章直击响应信号的物理实现与调试价值。4.1 OKAY 与 EXOKAY 的本质区别原子操作的“完成确认” vs “独占确认”OKAY2b00表示常规读写成功而EXOKAY2b01仅用于独占访问Exclusive Access的写响应且必须满足两个前提该写事务的AWLOCK2b01独占锁定从机在事务期间未检测到其他主设备对该地址的访问。EXOKAY的物理意义是“本次独占写已成功提交后续的独占读将返回OKAY”。若返回OKAY则表明独占状态已被破坏后续独占读必失败。RTL 中必须严格区分// 从机侧仅当 AWLOCK2b01 且独占状态有效时才可返回 EXOKAY wire exokay_possible (awlock 2b01) exclusive_state_valid; wire bresp_exokay exokay_possible (exclusive_access_succeeded); wire bresp_okay !exokay_possible || !exclusive_access_succeeded; assign bresp bresp_exokay ? 2b01 : bresp_okay ? 2b00 : slv_error ? 2b10 : 2b11;提示EXOKAY不是“高级版 OKAY”而是原子操作协议的必要环节。若从机不支持独占访问必须对AWLOCK2b01的事务返回SLVERR而非强行返回OKAY。4.2 SLVERR 与 DECERR 的故障域划分从机内部错误 vs 地址解码失败SLVERRSlave Error和DECERRDecode Error常被混用但协议赋予其明确边界DECERR地址解码器未命中任何从机即awaddr不在本从机地址空间内。这是互连层Interconnect或顶层地址译码器的责任从机不应主动产生DECERR。SLVERR地址有效但从机内部发生不可恢复错误如 FIFO 溢出、DMA 描述符非法、电源管理状态异常等。因此从机 RTL 的响应生成逻辑必须分层// 第一层地址空间检查决定是否响应 wire in_my_space (awaddr BASE_ADDR) (awaddr BASE_ADDR ADDR_SIZE); // 第二层内部状态检查决定响应类型 wire internal_error (fifo_full wvalid wready) || (dma_desc_invalid awvalid); // 第三层组合响应 assign bresp in_my_space ? (internal_error ? 2b10 : 2b00) : // SLVERR or OKAY 2b11; // DECERR —— 但注意此 DECERR 应由 Interconnect 产生关键纠正从机模块绝不应驱动BRESP2b11。DECERR是互连层信号从机只需对in_my_space0的请求忽略不驱动BVALID由互连统一返回DECERR。若从机擅自返回DECERR会导致多从机系统响应冲突。4.3 响应信号的时序陷阱为什么BVALID必须在WREADY之后且RVALID依赖ARREADY协议 3.1.3 和 3.1.5 明确规定响应信号的驱动时序BVALID必须在WREADY为高后的至少一个周期才能拉高。因为WREADY确认写数据已接收从机才开始处理并生成响应。RVALID必须在ARREADY为高后的至少一个周期才能拉高。因为ARREADY确认地址已接收从机才启动读取。违反此规则将导致主机无法正确采样响应。RTL 中必须插入同步寄存器// BRESP 生成流水线关键WREADY 后延时 reg [1:0] bresp_delayed; always (posedge ACLK or negedge ARESETn) begin if (!ARESETn) begin bresp_delayed 2b00; end else if (wready wvalid) begin // wready 为高表示本拍数据已收下拍可生成响应 bresp_delayed bresp_raw; end end assign bresp bresp_delayed;参数说明BRESP/RRESP为 2-bit编码固定不可更改。2b10SLVERR和2b11DECERR触发系统级错误中断是调试硬件故障的第一线索。务必在 SoC 集成时将这些信号接入全局错误监控模块。5. 避坑 / 常见问题 / 排查AXI3 实战中踩过的 5 个深坑每一个都让项目延期两周AXI3 协议文本看似清晰但落地时每个信号、每条规则都可能成为时序黑洞。以下是某 SoC 项目组在 32nm 工艺下用 27 个 testbench case 暴露并修复的真实问题。它们不来自理论推演而来自波形里反复出现的RVALID漂移、BVALID消失、WSTRB错位。5.1 现象RLAST总比预期晚一个周期导致主机 DMA 引擎超时重启原因RLAST的生成逻辑错误地依赖ARVALID而非ARREADY。协议 2.6 节规定“RLAST表示读突发中最后一个数据项的传输”而最后一个数据项的传输发生在RVALID RREADY为高的拍。若RLAST在ARVALID拉高时即置位而ARREADY延迟了 2 个周期则RLAST会提前 2 拍主机误判为单 beat 读后续数据被丢弃。解决RLAST必须与RVALID同步生成且仅在rready为高时采样burst_cnt计数器。正确代码always (posedge ACLK or negedge ARESETn) begin if (!ARESETn) begin rlast_reg 1b0; end else if (rvalid rready) begin rlast_reg (burst_cnt burst_len); // burst_cnt 在 rvalidrready 时递增 end end5.2 现象AWREADY在awvalid为高期间随机拉低导致主机地址丢失原因AWREADY信号被综合进组合逻辑受awaddr变化影响产生毛刺。协议 3.1.1 要求AWREADY默认值稳定且变化必须与时钟同步。若awaddr经过长路径到达awready生成逻辑毛刺会触发主机重发地址造成地址队列混乱。解决AWREADY输出必须经寄存器打拍且寄存器输入端加入同步使能reg awready_sync; always (posedge ACLK or negedge ARESETn) begin if (!ARESETn) begin awready_sync 1b1; end else if (awvalid) begin // 仅在 awvalid 有效时更新避免毛刺传播 awready_sync (addr_decoder_ready); end end assign awready awready_sync;5.3 现象WSTRB在WLAST为高时全为 0但WVALID仍为高从机拒绝接收原因主机侧逻辑错误地将WLAST与WSTRB绑定认为WLAST为高时WSTRB必须非零。但协议 2.3 节明确“WLAST表示突发中最后一次传输”而最后一次传输完全可以是WSTRB0如写入一个结构体最后一 beat 仅更新标志位其余字节不变。解决主机必须无条件在WLAST为高时驱动WVALID1WSTRB值由软件配置决定与WLAST无关。验证时需构造WSTRB0 WLAST1的 test case。5.4 现象多主机系统中BID返回值与AWID不一致导致主机无法匹配响应原因互连模块未对AWID进行扩展。协议 1.3.4 指出“互连负责将额外信息附加到 ID tag以保证来自所有主机的 ID tags 都是唯一的”。若 Core0 和 Core1 均使用AWID[3:0]4b0000互连必须输出BID[4:0]{1b0, AWID}和{1b1, AWID}否则从机返回的BID将全部为4b0000主机无法区分响应归属。解决互连 RTL 中BID生成必须包含主机 ID 位// 假设 2 个主机用 awid[4] 标识主机 wire [4:0] bid_out {awid_from_core0, awid[3:0]};5.5 现象ARESETn复位释放后ARREADY长时间为低主机读请求超时原因ARREADY默认值设为低且复位释放后内部地址解码器状态机未完成初始化。协议 3.1.4 推荐ARREADY默认高若设为低则必须确保在ARESETn拉高后状态机能在 1 个时钟周期内进入就绪态。解决ARREADY默认值设为高并在复位释放后 1 个周期内强制置高reg arready_reg; always (posedge ACLK or negedge ARESETn) begin if (!ARESETn) begin arready_reg 1b1; // 默认高 end else begin // 正常逻辑但复位后首周期必须确保为高 arready_reg (reset_done) ? arready_logic : 1b1; end end6. 验证与调试技巧用 ModelSim 波形定位 AXI3 时序问题的 3 个黄金断点写完 AXI3 Slave RTL仿真通过只是起点。真正的挑战在于当波形里RVALID与RREADY之间出现 3 个周期的 gap你如何快速判断是地址解码延迟、FIFO 读取阻塞还是RLAST逻辑错误我从某跨平台 SoC 项目中提炼出三个必设断点它们不是“看波形”而是“用波形提问”。6.1 断点 1AWVALID AWREADY采样点 —— 定位地址通道瓶颈在 ModelSim 中对awvalid awready设置break on value change。当断点触发时立即检查awaddr值是否在地址空间内awaddr BASE awaddr BASESIZEawsizes是否与数据总线宽度匹配如 32-bit 总线awsizes不能为3b111128 字节awburst类型是否被从机支持如从机不支持 WRAP则awburst2b10时应拉低awready。技巧在此断点处用force -freeze命令临时修改awaddr为边界值如BASE-1、BASESIZE观察awready是否立即变低。若不变说明地址解码逻辑有缺陷。6.2 断点 2WVALID WREADY采样点 —— 捕获写数据流控异常wvalid wready是写数据真正进入从机的瞬间。在此断点重点观察WSTRB值是否与awaddr低位匹配如awaddr[1:0]2b01WSTRB应为4b0110WLAST是否在burst_cnt burst_len时准确置位WDATA值是否与预期写入地址的内存内容一致可用mem display命令查看。技巧若发现WSTRB错位立即在断点处运行examine -radix binary wstrb并与awaddr[log2(num_bytes)-1:0]对比。90% 的非对齐问题源于此处。6.3 断点 3RVALID RREADY采样点 —— 验证读数据完整性这是最关键的断点。rvalid rready采样到的RDATA必须与ARADDR指向的内存单元值完全一致。操作步骤在断点触发时记录araddr值如32h0000_2000用mem display /range 00002000 00002000查看该地址内存值对比rdata与内存值若不等则问题在读取路径如 FIFO 读指针错位、RAM 读使能未及时拉高若相等再检查RLASTrlast为高时burst_cnt是否等于arlen1。表格AXI3 验证黄金参数速查表信号组合关键检查项正常波形特征异常表现awvalid awreadyawaddr对齐性awaddr[log2(num_bytes)-1:0] 0awaddr末位非零awready延迟wvalid wreadyWSTRB动态偏移WSTRB随awaddr[1:0]循环右移WSTRB恒定不变rvalid rreadyRDATA与内存一致性rdata mem[araddr]rdata为全 0 或随机值bvalid breadyBID与AWID匹配bid awid单主机或bid[4:1] awid多主机bid恒为 0从那以后我每次写完 AXI3 Slave都会在 ModelSim 里先跑这 3 个断点每个断点触发后必做上述 3 步检查。不是为了“证明它能跑”而是为了“证明它在任何 corner case 下都不会错”。AXI3 的优雅在于其解耦而它的残酷在于任何一个通道的微小偏差都会在系统集成时被指数级放大。希望帮到你。本文还有配套的精品资源点击获取